{"text_format":"1","workbook":"xlsx","n_sheets":9,"sheets":["הוצאות ניהול השקעות","חישוב","פנסיה ויוזמה","גמל והשתלמות","ביטוח","קובץ עזר","מכתב למבוטח","נתוני השקעות מנשה דבי","הפעלה"],"not_rendered":{"charts":0,"images":1,"macros":1,"external_links":0,"defined_names":15,"comments":0,"pivot_tables":0},"unopened":[],"bounds":{"document_bytes":16777216,"sheet_cells":100000,"rows_first":2000,"rows_last":500,"rows_between":2000,"halvings":0,"cell_chars":16384,"cell_head_chars":4096},"cells_cut":0,"cells_raw":0,"read":"whole","date_system":"1900"}

{"sheet":"הוצאות ניהול השקעות","index":0,"n_rows":95,"n_cols":7,"rows_kept":95,"cut":false,"hidden":true,"merged":[]}
["מס' קופה","שם מסלול משולב ","קוד מסלול באוצר","שם מסלול ","שיעור הוצאות ישירות מסוג עמלת ניהול חיצוני (מגבלה לשנת 2023)","שיעור הוצאות ישירות שאינן מסוכ עמלת ניהול חיצוני (נגבה בפועל בשנת 2022)","שיעור הוצאות לניהול השקעות 2022 (לחישוב עלות כוללת צפויה עדכני ל-29.05.2023)"]
[162,"מקפת אישית -כללי ",2102,"כללי ",2.5000000000000001E-3,2.0000000000000001E-4,2.7000000000000001E-3]
[162,"מקפת אישית -לבני 50 ומטה",8801,"לבני 50 ומטה",2.2000000000000001E-3,1.9999999999999987E-4,2.4000000000000002E-3]
[162,"מקפת אישית -לבני 50 עד 60",8802,"לבני 50 עד 60",2.2000000000000001E-3,2.0000000000000001E-4,2.3999999999999998E-3]
[162,"מקפת אישית -לבני 60 ומעלה",8803,"לבני 60 ומעלה",2.2000000000000001E-3,2.0000000000000001E-4,2.3999999999999998E-3]
[162,"מקפת אישית -לזכאים קיימים לקצבה",8602,"לזכאים קיימים לקצבה",1E-3,0,1E-3]
[162,"מקפת אישית -פנסיונרים חדשים",2207,"פנסיונרים חדשים",1E-3,1E-4,1.1000000000000001E-3]
[162,"מקפת אישית -למקבלי קצבה החל מ-2018",12145,"למקבלי קצבה החל מ-2018",1.2999999999999999E-3,1E-4,1.4E-3]
[162,"מקפת אישית -הלכה",2112,"הלכה",8.0000000000000004E-4,1.9999999999999998E-4,1E-3]
[162,"מקפת אישית -מניות ",2142,"מניות ",8.0000000000000004E-4,2.0000000000000001E-4,1E-3]
[162,"מקפת אישית -שקלי טווח קצר",2143,"שקלי טווח קצר",2.0000000000000001E-4,1E-4,3.0000000000000003E-4]
[162,"מקפת אישית -אג\"ח",2144,"אג\"ח",8.0000000000000004E-4,1E-4,8.9999999999999998E-4]
[162,"מקפת אישית -פנסיונרים הלכה",12146,"פנסיונרים הלכה",8.0000000000000004E-4,2.0000000000000001E-4,1E-3]
[162,"מקפת אישית -מניות למקבלי קצבה ",12147,"מניות למקבלי קצבה ",5.6000000000000006E-4,9.9999999999999964E-5,6.6E-4]
[162,"מקפת אישית -אג\"ח למקבלי קצבה ",12148,"אג\"ח למקבלי קצבה ",5.0000000000000001E-4,1E-4,5.9999999999999995E-4]
[162,"מקפת אישית -הלכה למקבלי קצבה קיימים",8603,"הלכה למקבלי קצבה קיימים",8.0000000000000004E-4,1.2999999999999999E-3,2.0999999999999999E-3]
[162,"מקפת אישית -מחקה מדד s&p500",13572,"מחקה מדד s&p500",5.9999999999999995E-4,3.0000000000000003E-4,8.9999999999999998E-4]
[162,"מקפת אישית -משולב סחיר",14242,"משולב סחיר",8.0000000000000004E-4,1E-4,8.9999999999999998E-4]
[162,"מקפת אישית -עוקב מדדים גמיש",14243,"עוקב מדדים גמיש",1E-3,8.9999999999999998E-4,1.9E-3]
[162,"מקפת אישית -פאסיבי - מדדי מניות",14929,"פאסיבי - מדדי מניות",8.0000000000000004E-4,2.9999999999999997E-4,1.1000000000000001E-3]
{"$rows_left_out":76}
{"sheet":"חישוב","index":1,"n_rows":89,"n_cols":10,"rows_kept":89,"cut":false,"hidden":true,"merged":[[54,0,55,0],[54,2,55,2],[54,3,55,3],[54,4,55,4],[56,0,57,0],[56,2,57,2],[56,3,57,3],[56,4,57,4],[50,0,51,0],[50,2,51,2],[50,3,51,3],[50,4,51,4],[52,0,53,0],[52,2,53,2],[52,3,53,3],[52,4,53,4],[58,0,59,0],[58,2,59,2],[58,3,59,3],[58,4,59,4],[35,0,36,0],[35,2,36,2],[35,3,36,3],[35,4,36,4],[46,0,47,0],[46,2,47,2],[46,3,47,3],[46,4,47,4],[48,0,49,0],[48,2,49,2],[48,3,49,3],[48,4,49,4],[33,0,34,0],[33,2,34,2],[33,3,34,3],[33,4,34,4],[31,0,32,0],[31,1,32,1],[31,2,32,2],[31,3,32,3],[31,4,32,4]]}
["[הנתונים המסומנים בצהוב יעודכנו באופן אוטומטי על פי נתוני העמית ושיעורי ההוצאות יעודכנו לפי הטבלה הצדדית של השיעורים הצפויים והקודמים ביחס לכל מסלול ההשקעה]"]
[null,null,null,null,null,null,"שם קובץ","alotMakefetP.docx"]
["שם העמית/מבוטח",null,null,"תאריך",{"$f":"DATE(YEAR(NOW()),MONTH(NOW()),DAY(NOW()))","v":"2024-02-20"},null,"שם קובץ לשמירה",{"$f":"MID(michtav,5,LEN(michtav)-9)","v":"MakefetP"}]
["מספר זיהוי"]
["מוצר","מקפת משלימה"]
["סוג עמית","קיים"]
["מספר חשבון/פוליסה"]
["צבירה"]
["דמי ניהול מצבירה",5.0000000000000001E-3]
["דמי ניהול מפרמיה",5.0000000000000001E-3]
[]
[]
["להמחשה בלבד:","עלות שנתית כוללת","לעמית קיים"]
[]
["סוג החיוב","סכום צבירה/הפקדה שנתית","מסלול השקעות","שיעור","סה\"כ"]
["דמי ניהול מצבירה (בהתאם לצבירת החיסכון המועד החישוב) ",{"$f":"B8","v":0},null,{"$f":"B9","v":5.0000000000000001E-3},null,null,null,"הצגת שיעור העלות השנתית הצפויה מהווה תחזית בלבד, ומבוססת על מגוון רחב של הנחות אשר חלקן מבוסס על נתוני שנים קודמות ועל נוסחת המרה אחידה, ואשר כולן נערכו בהתבסס על המידע שהיה זמין לגוף המוסדי בתחילת שנת הדיווח שבגינה מוצגת העלות השנתית הצפויה ובהתאם לנתונים האמורים. \nשיעור ההוצאות הישירות הצפוי בשל ביצוע השקעות מוצג לכל מסלול השקעה ובהתאם לצבירה בכל מסלול השקעה יחסית לצבירה הכוללת בכל מסלולים. \nאי לכך, אין בהצגה זו בכדי לחייב את הגוף המוסדי לגביית עלויות בהתאם לשיעור העלות השנתית הצפויה, וכי השיעור בפועל ייקבע בין היתר, בהתאם להשקעות שיבוצעו במהלך השנה, לתשואות שיושגו במהלך השנה על נכסי העמיתים/המבוטחים במסלול ההשקעה ובהתאם לסך המשיכות וההפקדות שיבוצעו בחשבון במהלך השנה. \nכמו כן, הגוף המוסדי אינו מחויב בעדכון או שינוי שיעור העלות השנתית הצפויה על מנת לשקף אירועים או נסיבות שיחולו לאחר הצגתו.","הצגת שיעור העלות השנתית הצפויה מהווה תחזית בלבד, ומבוססת על מגוון רחב של הנחות אשר חלקן מבוסס על נתוני שנים קודמות ועל נוסחת המרה אחידה, ואשר כולן נערכו בהתבסס על המידע שהיה זמין לגוף המוסדי בתחילת שנת הדיווח שבגינה מוצגת העלות השנתית הצפויה ובהתאם לנתונים האמורים. \nשיעור ההוצאות הישירות הצפוי בשל ביצוע השקעות מוצג לכל מסלול השקעה ובהתאם לצבירה בכל מסלול השקעה יחסית לצבירה הכוללת בכל מסלולים. \nאי לכך, אין בהצגה זו בכדי לחייב את הגוף המוסדי לגביית עלויות בהתאם לשיעור העלות השנתית הצפויה, וכי השיעור בפועל ייקבע בין היתר, בהתאם להשקעות שיבוצעו במהלך השנה, לתשואות שיושגו במהלך השנה על נכסי העמיתים/המבוטחים במסלול ההשקעה ובהתאם לסך המשיכות וההפקדות שיבוצעו בחשבון במהלך השנה. \nכמו כן, הגוף המוסדי אינו מחויב בעדכון או שינוי שיעור העלות השנתית הצפויה על מנת לשקף אירועים או נסיבות שיחולו לאחר הצגתו.","הצגת שיעור העלות השנתית הצפויה מהווה תחזית בלבד, ומבוססת על מגוון רחב של הנחות אשר חלקן מבוסס על נתוני שנים קודמות ועל נוסחת המרה אחידה, ואשר כולן נערכו בהתבסס על המידע שהיה זמין לגוף המוסדי בתחילת שנת הדיווח שבגינה מוצגת העלות השנתית הצפויה ובהתאם לנתונים האמורים. \nשיעור ההוצאות הישירות הצפוי בשל ביצוע השקעות מוצג לכל מסלול השקעה ובהתאם לצבירה בכל מסלול השקעה יחסית לצבירה הכוללת בכל מסלולים. \nאי לכך, אין בהצגה זו בכדי לחייב את הגוף המוסדי לגביית עלויות בהתאם לשיעור העלות השנתית הצפויה, וכי השיעור בפועל ייקבע בין היתר, בהתאם להשקעות שיבוצעו במהלך השנה, לתשואות שיושגו במהלך השנה על נכסי העמיתים/המבוטחים במסלול ההשקעה ובהתאם לסך המשיכות וההפקדות שיבוצעו בחשבון במהלך השנה. \nכמו כן, הגוף המוסדי אינו מחויב בעדכון או שינוי שיעור העלות השנתית הצפויה על מנת לשקף אירועים או נסיבות שיחולו לאחר הצגתו."]
["דמי ניהול לשנה מהפקדה (לפי הפקדה חודשית אחרונה), בגמל אין לעדכן שיעור ד\"נ",null,null,{"$f":"B10","v":5.0000000000000001E-3}]
["הוצאות ישירות כולל דמי עמלת ניהול חיצוני ",null,"מקפת משלימה-כללי",{"$f":"IF(C18<>\"\",VLOOKUP(C18,'הוצאות ניהול השקעות'!$B$2:$G$95,6,0),\"\")","v":2.7000000000000001E-3},{"$f":"IF(D18<>\"\",$D$16+$D$17/20+H18+I18,\"\")","v":7.9500000000000005E-3},{"$f":"IF(D18<>\"\",$D$16,\"\")","v":5.0000000000000001E-3},{"$f":"IF(D18<>\"\",$D$17/20,\"\")","v":2.5000000000000001E-4},{"$f":"IF(C18<>\"\",VLOOKUP(C18,'הוצאות ניהול השקעות'!$B$2:$G$95,4,0),\"\")","v":2.5000000000000001E-3},{"$f":"IF(C18<>\"\",VLOOKUP(C18,'הוצאות ניהול השקעות'!$B$2:$G$95,5,0),\"\")","v":2.0000000000000001E-4}]
["הוצאות ישירות כולל דמי עמלת ניהול חיצוני ",null,null,{"$f":"IF(C19<>\"\",VLOOKUP(C19,'הוצאות ניהול השקעות'!$B$2:$G$95,6,0),\"\")","v":""},{"$f":"IF(D19<>\"\",$D$16+$D$17/20+H19+I19,\"\")","v":""},{"$f":"IF(D19<>\"\",$D$16,\"\")","v":""},{"$f":"IF(D19<>\"\",$D$17/20,\"\")","v":""},{"$f":"IF(C19<>\"\",VLOOKUP(C19,'הוצאות ניהול השקעות'!$B$2:$G$95,4,0),\"\")","v":""},{"$f":"IF(C19<>\"\",VLOOKUP(C19,'הוצאות ניהול השקעות'!$B$2:$G$95,5,0),\"\")","v":""}]
["הוצאות ישירות כולל דמי עמלת ניהול חיצוני ",null,null,{"$f":"IF(C20<>\"\",VLOOKUP(C20,'הוצאות ניהול השקעות'!$B$2:$G$95,6,0),\"\")","v":""},"","","",{"$f":"IF(C20<>\"\",VLOOKUP(C20,'הוצאות ניהול השקעות'!$B$2:$G$95,4,0),\"\")","v":""},{"$f":"IF(C20<>\"\",VLOOKUP(C20,'הוצאות ניהול השקעות'!$B$2:$G$95,5,0),\"\")","v":""}]
{"$rows_left_out":70}
{"sheet":"פנסיה ויוזמה","index":2,"n_rows":35,"n_cols":10,"rows_kept":35,"cut":false,"hidden":true,"merged":[]}
["מוצר","מס' קופה ","משולב","מס' מסלול","שם מסלול ","שיעור מגבלה 2023","שיעור הוצאות לניהול השקעות","מזה: שיעור ההוצאות לניהול חיצוני","שיעור הוצאות שאינן ניהול חיצוני (לפי 2022)","שיעור ההוצאות הישירות הצפויות "]
["מקפת אישית ",162,{"$f":"A2&\"-\"&E2","v":"מקפת אישית -כללי "},2102,"כללי ",2.5000000000000001E-3,1.7278676579675718E-3,1.4889833316954829E-3,{"$f":"G2-H2","v":2.3888432627208896E-4},{"$f":"MIN(I2+F2,0.25%)","v":2.5000000000000001E-3}]
["מקפת אישית ",162,{"$f":"A3&\"-\"&E3","v":"מקפת אישית -לבני 50 ומטה"},8801,"לבני 50 ומטה",2.2000000000000001E-3,1.4402197563818545E-3,1.2079260383214599E-3,{"$f":"G3-H3","v":2.3229371806039452E-4},{"$f":"MIN(I3+F3,0.25%)","v":2.4322937180603944E-3}]
["מקפת אישית ",162,"מקפת אישית -לבני 50 עד 60",8802,"לבני 50 עד 60",2.2000000000000001E-3,1.3147156653572497E-3,1.1105094224374693E-3,2.0420624291978039E-4,2.4042062429197805E-3]
["מקפת אישית ",162,"מקפת אישית -לבני 60 ומעלה ",8803,"לבני 60 ומעלה ",2.2000000000000001E-3,1.0400117025691571E-3,8.667731692484379E-4,1.7323853332071922E-4,2.3732385333207194E-3]
["מקפת אישית ",162,"מקפת אישית -לזכאים קיימים לקצבה",8602,"לזכאים קיימים לקצבה",1E-3,null,null,0,1E-3]
["מקפת אישית ",162,"מקפת אישית -פנסיונרים חדשים",2207,"פנסיונרים חדשים",1E-3,null,null,0,1E-3]
["מקפת אישית ",162,"מקפת אישית -למקבלי קצבה החל מ-2018",12145,"למקבלי קצבה החל מ-2018",1.2999999999999999E-3,null,null,0,1.2999999999999999E-3]
["מקפת אישית ",162,"מקפת אישית -הלכה",2112,"הלכה",1E-3,6.7790316681657563E-4,5.0353299403077762E-4,1.7437017278579801E-4,1.1743701727857979E-3]
["מקפת אישית ",162,"מקפת אישית -מניות ",2142,"מניות ",1E-3,6.2601079373775877E-4,3.8038123993693518E-4,2.4562955380082359E-4,1.2456295538008236E-3]
["מקפת אישית ",162,"מקפת אישית -שקלי טווח קצר",2143,"שקלי טווח קצר",2.0000000000000001E-4,1.0094113581347023E-4,0,1.0094113581347023E-4,3.0094113581347027E-4]
["מקפת אישית ",162,"מקפת אישית -אג\"ח",2144,"אג\"ח",8.0000000000000004E-4,3.2439167032916679E-4,2.1120880204808539E-4,1.1318286828108139E-4,9.1318286828108138E-4]
["מקפת אישית ",162,"מקפת אישית -פנסיונרים הלכה",12146,"פנסיונרים הלכה",8.0000000000000004E-4,null,null,0,8.0000000000000004E-4]
["מקפת אישית ",162,"מקפת אישית -מניות למקבלי קצבה ",12147,"מניות למקבלי קצבה ",5.6000000000000006E-4,null,null,0,5.6000000000000006E-4]
["מקפת אישית ",162,"מקפת אישית -אג\"ח למקבלי קצבה ",12148,"אג\"ח למקבלי קצבה ",5.0000000000000001E-4,null,null,0,5.0000000000000001E-4]
["מקפת אישית ",162,"מקפת אישית -הלכה למקבלי קצבה קיימים",8603,"הלכה למקבלי קצבה קיימים",8.0000000000000004E-4,null,null,0,8.0000000000000004E-4]
["מקפת אישית ",162,"מקפת אישית -מחקה מדד s&p500",13572,"מחקה מדד s&p500",8.0000000000000004E-4,6.8684618887285438E-4,1.5298082532431815E-4,5.3386536354853623E-4,1.3338653635485364E-3]
["מקפת אישית ",162,"מקפת אישית -משולב סחיר",14242,"משולב סחיר",8.0000000000000004E-4,null,null,0,8.0000000000000004E-4]
["מקפת אישית ",162,"מקפת אישית -עוקב מדדים גמיש",14243,"עוקב מדדים גמיש",1E-3,null,null,0,1E-3]
["מקפת משלימה",659,"מקפת משלימה-כללי ",2145,"כללי ",2.5000000000000001E-3,1.6499071700913806E-3,1.4328596547360118E-3,2.1704751535536878E-4,2.5000000000000001E-3]
{"$rows_left_out":16}
{"sheet":"גמל והשתלמות","index":3,"n_rows":36,"n_cols":9,"rows_kept":36,"cut":false,"hidden":true,"merged":[]}
["מוצר","מס' קופה ","מס' מסלול","שם מסלול ","שיעור מגבלה 2023","שיעור הוצאות לניהול השקעות","מזה: שיעור ההוצאות לניהול חיצוני","שיעור הוצאות שאינן ניהול חיצוני (לפי 2022)","שיעור ההוצאות הישירות הצפויות "]
["מגדל גמל להשקעה ",null,7936,"כללי ",{"$f":"0.25/100","v":2.5000000000000001E-3},{"$f":"0.14/100","v":1.4000000000000002E-3},1.1999999999999999E-3,{"$f":"F2-G2","v":2.0000000000000031E-4},{"$f":"MIN(H2+E2,0.25%)","v":2.5000000000000001E-3}]
["מגדל גמל להשקעה ",null,7937,"הלכה ",1.2999999999999999E-3,1E-3,6.9999999999999999E-4,{"$f":"F3-G3","v":3.0000000000000003E-4},{"$f":"MIN(H3+E3,0.25%)","v":1.5999999999999999E-3}]
["מגדל גמל להשקעה ",null,7934,"מניות",1.1999999999999999E-3,8.0000000000000004E-4,5.0000000000000001E-4,3.0000000000000003E-4,1.5E-3]
["מגדל גמל להשקעה ",null,7933,"חו\"ל",2.5000000000000001E-3,1.8E-3,1.4E-3,3.9999999999999996E-4,2.5000000000000001E-3]
["מגדל גמל להשקעה ",null,7932,"אג\"ח ממשלתי ישראל",2.0000000000000001E-4,2.9999999999999997E-4,null,2.9999999999999997E-4,5.0000000000000001E-4]
["מגדל גמל להשקעה ",null,7931,"שקלי טווח קצר",2.0000000000000001E-4,2.0000000000000001E-4,null,2.0000000000000001E-4,4.0000000000000002E-4]
["מגדל גמל להשקעה ",null,7935,"אג\"ח עד 10% מניות",1E-3,5.0000000000000001E-4,2.9999999999999997E-4,2.0000000000000004E-4,1.2000000000000001E-3]
["מגדל גמל להשקעה ",null,13563,"s&p500",1E-3,8.9999999999999998E-4,2.0000000000000001E-4,6.9999999999999999E-4,1.7000000000000001E-3]
["מגדל השתלמות",null,579,"כללי ",2.5000000000000001E-3,1.9E-3,1.6000000000000001E-3,2.9999999999999992E-4,2.5000000000000001E-3]
["מגדל השתלמות",null,7253,"לבני 50 ומטה",2.5000000000000001E-3,1.5E-3,1.1999999999999999E-3,3.0000000000000014E-4,2.5000000000000001E-3]
["מגדל השתלמות",null,7254,"לבני 50 עד 60",2.5000000000000001E-3,1.4E-3,1E-3,3.9999999999999996E-4,2.5000000000000001E-3]
["מגדל השתלמות",null,470,"לבני 60 ומעלה ",2.5000000000000001E-3,8.9999999999999998E-4,6.9999999999999999E-4,1.9999999999999998E-4,2.5000000000000001E-3]
["מגדל השתלמות",null,7256,"השתלמות פאסיבי",1.2999999999999999E-3,1.1000000000000001E-3,8.0000000000000004E-4,3.0000000000000003E-4,1.5999999999999999E-3]
["מגדל השתלמות",null,2048,"הלכה ",1.2999999999999999E-3,1E-3,6.9999999999999999E-4,3.0000000000000003E-4,1.5999999999999999E-3]
["מגדל השתלמות",null,869,"מניות",1.1999999999999999E-3,8.0000000000000004E-4,5.0000000000000001E-4,3.0000000000000003E-4,1.5E-3]
["מגדל השתלמות",null,868,"חו\"ל",2.5000000000000001E-3,1.6000000000000001E-3,1.2999999999999999E-3,3.0000000000000014E-4,2.5000000000000001E-3]
["מגדל השתלמות",null,865,"אג\"ח ממשלתי ישראל",2.0000000000000001E-4,2.9999999999999997E-4,null,2.9999999999999997E-4,5.0000000000000001E-4]
["מגדל השתלמות",null,864,"שקלי טווח קצר",2.0000000000000001E-4,1E-4,null,1E-4,3.0000000000000003E-4]
["מגדל השתלמות",null,199,"אג\"ח",1E-3,4.0000000000000002E-4,2.9999999999999997E-4,1.0000000000000005E-4,1.1000000000000001E-3]
{"$rows_left_out":17}
{"sheet":"ביטוח","index":4,"n_rows":174,"n_cols":9,"rows_kept":174,"cut":false,"hidden":true,"merged":[]}
["מוצר","מס' קופה ","מס' מסלול","שם מסלול ","שיעור מגבלה 2023","שיעור הוצאות לניהול השקעות","מזה: שיעור ההוצאות לניהול חיצוני","שיעור הוצאות שאינן ניהול חיצוני (לפי 2022)","שיעור ההוצאות הישירות הצפויות "]
["מגדל",17010,null,"משתתף ברווחים קרן ח'",2.8999999999999998E-3]
["מגדל",17011,null,"משתתף ברווחים קרן ט'",2.8999999999999998E-3]
["מגדל",17012,null,"משתתף ברווחים קרן י'",2.8999999999999998E-3]
["מגדל",17013,null,"משתתף ברווחים קרן ' החדשה",2.5000000000000001E-3]
["מגדל",9599,null,"לבני 50 ומטה מנוהל",2.5000000000000001E-3]
["מגדל",9604,null,"לבני 50 עד 60 מנוהל",2.5000000000000001E-3]
["מגדל",9729,null,"לבני 60 ומעלה מנוהל",2.5000000000000001E-3]
[null,"תוספת שלי ",null,"לבני 50 ומטה לא מנוהל",2.5000000000000001E-3]
[null,"תוספת שלי ",null,"לבני 50 עד 60 לא מנוהל",2.5000000000000001E-3]
[null,"תוספת שלי ",null,"לבני 60 ומעלה לא מנוהל",2.5000000000000001E-3]
["מגדל",75,null,"כללי 3 עד 65% מניות",1.5E-3]
["מגדל",9606,null,"למקבלי קצבה",2.5000000000000001E-3]
["מגדל",null,185,"הלכה",1.2999999999999999E-3]
["מגדל",null,76,"מניות",1.1999999999999999E-3]
["מגדל",null,8660,"חו\"ל",2.5000000000000001E-3]
["מגדל",null,68,"אג\"ח ממשלת ישראל",2.0000000000000001E-4]
["מגדל",null,1955,"שקלי טווח קצר",2.0000000000000001E-4]
["מגדל",null,8659,"אג\"ח",1E-3]
["מגדל",null,69,"אג\"ח עד 10% מניות",1E-3]
{"$rows_left_out":155}
{"sheet":"קובץ עזר","index":5,"n_rows":6,"n_cols":8,"rows_kept":6,"cut":false,"hidden":true,"merged":[]}
[null,"תגמולים","פיצויים","סה\"כ"]
[null,{"$f":"חישוב!$B$34","v":0.14499999999999999},{"$f":"חישוב!$B$36","v":8.3000000000000004E-2},{"$f":"SUM(B2:C2)","v":0.22799999999999998},{"$f":"IF(B2>F2,\"שיעור תגמולים גבוה מהמותר\",0)","v":0},0.14499999999999999,null,"מקסימום 14.5% בתמולים"]
[null,{"$f":"חישוב!$B$34","v":0.14499999999999999},{"$f":"חישוב!$B$36","v":8.3000000000000004E-2},{"$f":"SUM(B3:C3)","v":0.22799999999999998},{"$f":"IF(C3>F3,\"שיעור פיצויים גבוה מהמותר\",0)","v":0},8.3400000000000002E-2,null,"מקסימום 8.34% פיצויים"]
[null,{"$f":"חישוב!$B$34","v":0.14499999999999999},{"$f":"חישוב!$B$36","v":8.3000000000000004E-2},{"$f":"SUM(B4:C4)","v":0.22799999999999998},{"$f":"IF(C4>F4,\"שיעור הפרשות כולל גבוה מהמותר\",0)","v":0},0.22839999999999999,null,"מקסימום כולל 22.84%"]
[null,{"$f":"חישוב!$B$34","v":0.14499999999999999},{"$f":"חישוב!$B$36","v":8.3000000000000004E-2},{"$f":"SUM(B5:C5)","v":0.22799999999999998},{"$f":"IF(AND(C5>0,B5<F5),\"לא ניתן לשלם פיצויים ללא תגמולים מינימליים\",0)","v":0},0.1,null,"אם יש פיצויים חייבים מינימום 10% תגמולים"]
[null,null,null,null,{"$f":"COUNT(E2:E5)","v":4}]

{"sheet":"מכתב למבוטח","index":6,"n_rows":0,"n_cols":0,"rows_kept":0,"cut":false,"hidden":true,"merged":[]}

{"sheet":"נתוני השקעות מנשה דבי","index":7,"n_rows":292,"n_cols":12,"rows_kept":292,"cut":false,"hidden":true,"merged":[]}
["קוד חברה","תאריך נכונות דיווח","מס' קרן","שם הקרן","חדש / ישן ","קרן באוצר ","תשואה ברוטו מתחילת שנה","תשואה ברוטו ב- 5 שנים","שיעור הוצאות ישירות","שיעור הוצאות ניהול חיצוני","שיעור הוצאות לניהול השקעות","מזה: שיעור ההוצאות לניהול חיצוני"]
[1,"31.12.21",14,"קרן ח'","ישן ",17010,0.13644007462521968,0.42034439328267936,1.0802896003841503E-3,9.3346751990995818E-4,{"$f":"VLOOKUP(C2,ביטוח!$C$27:$H$174,4,0)","v":{"$error":"#N/A"}},{"$f":"VLOOKUP(C2,ביטוח!$C$27:$H$174,5,0)","v":{"$error":"#N/A"}}]
[1,"31.12.21",20,"קרן ח'","ישן ",17010,0.13644007462521968,0.42034439328267936,1.0802896003841503E-3,9.3346751990995818E-4,{"$f":"VLOOKUP(C3,ביטוח!$C$27:$H$174,4,0)","v":{"$error":"#N/A"}},{"$f":"VLOOKUP(C3,ביטוח!$C$27:$H$174,5,0)","v":{"$error":"#N/A"}}]
[1,"31.12.21",60,"קרן ח'","ישן ",17010,0.13644007462521968,0.42034439328267936,1.0802896003841503E-3,9.3346751990995818E-4,{"$f":"VLOOKUP(C4,ביטוח!$C$27:$H$174,4,0)","v":{"$error":"#N/A"}},{"$f":"VLOOKUP(C4,ביטוח!$C$27:$H$174,5,0)","v":{"$error":"#N/A"}}]
[1,"31.12.21",61,"קרן ח'","ישן ",17010,0.13644007462521968,0.42034439328267936,1.0802896003841503E-3,9.3346751990995818E-4,{"$f":"VLOOKUP(C5,ביטוח!$C$27:$H$174,4,0)","v":{"$error":"#N/A"}},{"$f":"VLOOKUP(C5,ביטוח!$C$27:$H$174,5,0)","v":{"$error":"#N/A"}}]
[1,"31.12.21",21,"קרן ט'","ישן ",17011,0.13461841112133954,0.41424962749144267,1.2464580375258735E-3,1.1201842379772004E-3,{"$f":"VLOOKUP(C6,ביטוח!$C$27:$H$174,4,0)","v":{"$error":"#N/A"}},{"$f":"VLOOKUP(C6,ביטוח!$C$27:$H$174,5,0)","v":{"$error":"#N/A"}}]
[1,"31.12.21",22,"קרן ט'","ישן ",17011,0.13461841112133954,0.41424962749144267,1.2464580375258735E-3,1.1201842379772004E-3,{"$f":"VLOOKUP(C7,ביטוח!$C$27:$H$174,4,0)","v":{"$error":"#N/A"}},{"$f":"VLOOKUP(C7,ביטוח!$C$27:$H$174,5,0)","v":{"$error":"#N/A"}}]
[1,"31.12.21",621,"קרן ט'","ישן ",17011,0.13461841112133954,0.41424962749144267,1.2464580375258735E-3,1.1201842379772004E-3,{"$f":"VLOOKUP(C8,ביטוח!$C$27:$H$174,4,0)","v":{"$error":"#N/A"}},{"$f":"VLOOKUP(C8,ביטוח!$C$27:$H$174,5,0)","v":{"$error":"#N/A"}}]
[1,"31.12.21",522,"קרן ט'","ישן ",17011,0.13461841112133954,0.41424962749144267,1.2464580375258735E-3,1.1201842379772004E-3,{"$f":"VLOOKUP(C9,ביטוח!$C$27:$H$174,4,0)","v":{"$error":"#N/A"}},{"$f":"VLOOKUP(C9,ביטוח!$C$27:$H$174,5,0)","v":{"$error":"#N/A"}}]
[1,"31.12.21",41,"קרן ט'","ישן ",17011,0.13461841112133954,0.41424962749144267,1.2464580375258735E-3,1.1201842379772004E-3,{"$f":"VLOOKUP(C10,ביטוח!$C$27:$H$174,4,0)","v":{"$error":"#N/A"}},{"$f":"VLOOKUP(C10,ביטוח!$C$27:$H$174,5,0)","v":{"$error":"#N/A"}}]
[1,"31.12.21",42,"קרן ט'","ישן ",17011,0.13461841112133954,0.41424962749144267,1.2464580375258735E-3,1.1201842379772004E-3,{"$f":"VLOOKUP(C11,ביטוח!$C$27:$H$174,4,0)","v":{"$error":"#N/A"}},{"$f":"VLOOKUP(C11,ביטוח!$C$27:$H$174,5,0)","v":{"$error":"#N/A"}}]
[1,"31.12.21",62,"קרן ט'","ישן ",17011,0.13461841112133954,0.41424962749144267,1.2464580375258735E-3,1.1201842379772004E-3,{"$f":"VLOOKUP(C12,ביטוח!$C$27:$H$174,4,0)","v":{"$error":"#N/A"}},{"$f":"VLOOKUP(C12,ביטוח!$C$27:$H$174,5,0)","v":{"$error":"#N/A"}}]
[1,"31.12.21",63,"קרן ט'","ישן ",17011,0.13461841112133954,0.41424962749144267,1.2464580375258735E-3,1.1201842379772004E-3,{"$f":"VLOOKUP(C13,ביטוח!$C$27:$H$174,4,0)","v":{"$error":"#N/A"}},{"$f":"VLOOKUP(C13,ביטוח!$C$27:$H$174,5,0)","v":{"$error":"#N/A"}}]
[1,"31.12.21",562,"קרן ט'","ישן ",17011,0.13461841112133954,0.41424962749144267,1.2464580375258735E-3,1.1201842379772004E-3,{"$f":"VLOOKUP(C14,ביטוח!$C$27:$H$174,4,0)","v":{"$error":"#N/A"}},{"$f":"VLOOKUP(C14,ביטוח!$C$27:$H$174,5,0)","v":{"$error":"#N/A"}}]
[1,"31.12.21",563,"קרן ט'","ישן ",17011,0.13461841112133954,0.41424962749144267,1.2464580375258735E-3,1.1201842379772004E-3,{"$f":"VLOOKUP(C15,ביטוח!$C$27:$H$174,4,0)","v":{"$error":"#N/A"}},{"$f":"VLOOKUP(C15,ביטוח!$C$27:$H$174,5,0)","v":{"$error":"#N/A"}}]
[1,"31.12.21",23,"קרן ט' הסנה ","ישן ",17011,0.15490387025826857,0.46963136193916344,1.2464580375258735E-3,1.1201842379772004E-3,{"$f":"VLOOKUP(C16,ביטוח!$C$27:$H$174,4,0)","v":{"$error":"#N/A"}},{"$f":"VLOOKUP(C16,ביטוח!$C$27:$H$174,5,0)","v":{"$error":"#N/A"}}]
[1,"31.12.21",27,"קרן ט' הסנה ","ישן ",17011,0.15490387025826857,0.46963136193916344,1.2464580375258735E-3,1.1201842379772004E-3,{"$f":"VLOOKUP(C17,ביטוח!$C$27:$H$174,4,0)","v":{"$error":"#N/A"}},{"$f":"VLOOKUP(C17,ביטוח!$C$27:$H$174,5,0)","v":{"$error":"#N/A"}}]
[1,"31.12.21",66,"קרן ט' הסנה ","ישן ",17011,0.15490387025826857,0.46963136193916344,1.2464580375258735E-3,1.1201842379772004E-3,{"$f":"VLOOKUP(C18,ביטוח!$C$27:$H$174,4,0)","v":{"$error":"#N/A"}},{"$f":"VLOOKUP(C18,ביטוח!$C$27:$H$174,5,0)","v":{"$error":"#N/A"}}]
[1,"31.12.21",67,"קרן ט' הסנה ","ישן ",17011,0.15490387025826857,0.46963136193916344,1.2464580375258735E-3,1.1201842379772004E-3,{"$f":"VLOOKUP(C19,ביטוח!$C$27:$H$174,4,0)","v":{"$error":"#N/A"}},{"$f":"VLOOKUP(C19,ביטוח!$C$27:$H$174,5,0)","v":{"$error":"#N/A"}}]
[1,"31.12.21",24,"קרן י' הישנה","ישן ",17012,0.15043920134320166,0.48009789863764873,1.9622965058540211E-3,1.7568564470650473E-3,{"$f":"VLOOKUP(C20,ביטוח!$C$27:$H$174,4,0)","v":{"$error":"#N/A"}},{"$f":"VLOOKUP(C20,ביטוח!$C$27:$H$174,5,0)","v":{"$error":"#N/A"}}]
{"$rows_left_out":273}
{"sheet":"הפעלה","index":8,"n_rows":0,"n_cols":0,"rows_kept":0,"cut":false,"hidden":false,"merged":[]}